Summary
PASSED 146
   17%
FAILED 698
   82%
ALL 844
Subsections
Name Total Passed Failed Progress Percent
jakarta_servlet 485 99 386
20%
jakarta_servlet_http 359 47 312
13%
Package: Test:
Tests
Package Test Result
com.sun.ts.tests.servlet.api.jakarta_servlet.servletrequestwrapper.URLClient removeAttributeTest FAILED
com.sun.ts.tests.servlet.api.jakarta_servlet.servletrequestwrapper.URLClient requestWrapperConstructorTest FAILED
com.sun.ts.tests.servlet.api.jakarta_servlet.servletrequestwrapper.URLClient requestWrapperGetRequestTest FAILED
com.sun.ts.tests.servlet.api.jakarta_servlet.servletrequestwrapper.URLClient requestWrapperSetRequestIllegalArgumentExceptionTest FAILED
com.sun.ts.tests.servlet.api.jakarta_servlet.servletrequestwrapper.URLClient requestWrapperSetRequestTest FAILED
com.sun.ts.tests.servlet.api.jakarta_servlet.servletrequestwrapper.URLClient setAttributeTest FAILED
com.sun.ts.tests.servlet.api.jakarta_servlet.servletrequestwrapper.URLClient setCharacterEncodingTest FAILED
com.sun.ts.tests.servlet.api.jakarta_servlet.servletrequestwrapper.URLClient setCharacterEncodingTest1 FAILED
com.sun.ts.tests.servlet.api.jakarta_servlet.servletrequestwrapper.URLClient setCharacterEncodingUnsupportedEncodingExceptionTest FAILED
com.sun.ts.tests.servlet.api.jakarta_servlet.servletrequestwrapper30.URLClient asyncStartedTest1 FAILED
com.sun.ts.tests.servlet.api.jakarta_servlet.servletrequestwrapper30.URLClient asyncStartedTest2 FAILED
com.sun.ts.tests.servlet.api.jakarta_servlet.servletrequestwrapper30.URLClient asyncStartedTest3 FAILED
com.sun.ts.tests.servlet.api.jakarta_servlet.servletrequestwrapper30.URLClient asyncStartedTest4 FAILED
com.sun.ts.tests.servlet.api.jakarta_servlet.servletrequestwrapper30.URLClient getAsyncContextTest FAILED
com.sun.ts.tests.servlet.api.jakarta_servlet.servletrequestwrapper30.URLClient getDispatcherTypeTestAsync FAILED
com.sun.ts.tests.servlet.api.jakarta_servlet.servletrequestwrapper30.URLClient getDispatcherTypeTestError FAILED
com.sun.ts.tests.servlet.api.jakarta_servlet.servletrequestwrapper30.URLClient getDispatcherTypeTestForward FAILED
com.sun.ts.tests.servlet.api.jakarta_servlet.servletrequestwrapper30.URLClient getDispatcherTypeTestInclude FAILED
com.sun.ts.tests.servlet.api.jakarta_servlet.servletrequestwrapper30.URLClient getDispatcherTypeTestRequest FAILED
com.sun.ts.tests.servlet.api.jakarta_servlet.servletrequestwrapper30.URLClient getServletContextTest FAILED
<< < 381 - 400 of 844 > >>
requeue tests (844 tests) - analyze issues (844 tests) - run script (844 tests) - download logs zip (844 tests)