Summary
PASSED 146
   17%
FAILED 698
   82%
ALL 844
Subsections
Name Total Passed Failed Progress Percent
jakarta_servlet 485 99 386
20%
jakarta_servlet_http 359 47 312
13%
Package: Test:
Tests
Package Test Result
com.sun.ts.tests.servlet.api.jakarta_servlet.servletresponse.URLClient getWriterFlushTest FAILED
com.sun.ts.tests.servlet.api.jakarta_servlet.servletresponse.URLClient getWriterIllegalStateExceptionTest FAILED
com.sun.ts.tests.servlet.api.jakarta_servlet.servletresponse.URLClient getWriterTest FAILED
com.sun.ts.tests.servlet.api.jakarta_servlet.servletresponse.URLClient isCommittedTest FAILED
com.sun.ts.tests.servlet.api.jakarta_servlet.servletresponse.URLClient resetBufferTest FAILED
com.sun.ts.tests.servlet.api.jakarta_servlet.servletresponse.URLClient resetIllegalStateExceptionTest FAILED
com.sun.ts.tests.servlet.api.jakarta_servlet.servletresponse.URLClient resetTest FAILED
com.sun.ts.tests.servlet.api.jakarta_servlet.servletresponse.URLClient resetTest1 FAILED
com.sun.ts.tests.servlet.api.jakarta_servlet.servletresponse.URLClient setBufferSizeIllegalStateExceptionTest FAILED
com.sun.ts.tests.servlet.api.jakarta_servlet.servletresponse.URLClient setBufferSizeTest FAILED
com.sun.ts.tests.servlet.api.jakarta_servlet.servletresponse.URLClient setCharacterEncodingTest FAILED
com.sun.ts.tests.servlet.api.jakarta_servlet.servletresponse.URLClient setContentLengthTest FAILED
com.sun.ts.tests.servlet.api.jakarta_servlet.servletresponse.URLClient setContentType1Test FAILED
com.sun.ts.tests.servlet.api.jakarta_servlet.servletresponse.URLClient setContentType2Test FAILED
com.sun.ts.tests.servlet.api.jakarta_servlet.servletresponse.URLClient setContentTypeTest FAILED
com.sun.ts.tests.servlet.api.jakarta_servlet.servletresponse.URLClient setLocale1Test FAILED
com.sun.ts.tests.servlet.api.jakarta_servlet.servletresponse.URLClient setLocaleTest FAILED
com.sun.ts.tests.servlet.api.jakarta_servlet.servletresponsewrapper.URLClient flushBufferTest FAILED
com.sun.ts.tests.servlet.api.jakarta_servlet.servletresponsewrapper.URLClient getBufferSizeTest FAILED
com.sun.ts.tests.servlet.api.jakarta_servlet.servletresponsewrapper.URLClient getCharacterEncodingTest FAILED
<< < 421 - 440 of 844 > >>
requeue tests (844 tests) - analyze issues (844 tests) - run script (844 tests) - download logs zip (844 tests)