Summary
PASSED 146
   17%
FAILED 698
   82%
ALL 844
Subsections
Name Total Passed Failed Progress Percent
jakarta_servlet 485 99 386
20%
jakarta_servlet_http 359 47 312
13%
Package: Test:
Tests
Package Test Result
com.sun.ts.tests.servlet.api.jakarta_servlet_http.httpservletrequestwrapper.URLClient httpRequestWrapperSetRequestTest FAILED
com.sun.ts.tests.servlet.api.jakarta_servlet_http.httpservletrequestwrapper.URLClient isRequestedSessionIdFromCookieTest FAILED
com.sun.ts.tests.servlet.api.jakarta_servlet_http.httpservletrequestwrapper.URLClient isRequestedSessionIdFromCookieTest1 FAILED
com.sun.ts.tests.servlet.api.jakarta_servlet_http.httpservletrequestwrapper.URLClient isRequestedSessionIdFromURLTest FAILED
com.sun.ts.tests.servlet.api.jakarta_servlet_http.httpservletrequestwrapper.URLClient isRequestedSessionIdValidTest FAILED
com.sun.ts.tests.servlet.api.jakarta_servlet_http.httpservletrequestwrapper.URLClient isSecureTest FAILED
com.sun.ts.tests.servlet.api.jakarta_servlet_http.httpservletrequestwrapper.URLClient removeAttributeTest FAILED
com.sun.ts.tests.servlet.api.jakarta_servlet_http.httpservletrequestwrapper.URLClient setAttributeTest FAILED
com.sun.ts.tests.servlet.api.jakarta_servlet_http.httpservletrequestwrapper.URLClient setCharacterEncodingTest FAILED
com.sun.ts.tests.servlet.api.jakarta_servlet_http.httpservletrequestwrapper.URLClient setCharacterEncodingTest1 FAILED
com.sun.ts.tests.servlet.api.jakarta_servlet_http.httpservletrequestwrapper.URLClient setCharacterEncodingUnsupportedEncodingExceptionTest FAILED
com.sun.ts.tests.servlet.api.jakarta_servlet_http.httpservletresponse.URLClient addCookieTest FAILED
com.sun.ts.tests.servlet.api.jakarta_servlet_http.httpservletresponse.URLClient addDateHeaderTest FAILED
com.sun.ts.tests.servlet.api.jakarta_servlet_http.httpservletresponse.URLClient addHeaderTest FAILED
com.sun.ts.tests.servlet.api.jakarta_servlet_http.httpservletresponse.URLClient addIntHeaderTest FAILED
com.sun.ts.tests.servlet.api.jakarta_servlet_http.httpservletresponse.URLClient containsHeaderTest FAILED
com.sun.ts.tests.servlet.api.jakarta_servlet_http.httpservletresponse.URLClient flushBufferTest FAILED
com.sun.ts.tests.servlet.api.jakarta_servlet_http.httpservletresponse.URLClient getBufferSizeTest FAILED
com.sun.ts.tests.servlet.api.jakarta_servlet_http.httpservletresponse.URLClient getCharacterEncodingDefaultTest FAILED
com.sun.ts.tests.servlet.api.jakarta_servlet_http.httpservletresponse.URLClient getCharacterEncodingTest FAILED
<< < 661 - 680 of 844 > >>
requeue tests (844 tests) - analyze issues (844 tests) - run script (844 tests) - download logs zip (844 tests)