Summary
PASSED 52
   61%
FAILED 33
   38%
ALL 85
Subsections
Name Total Passed Failed Progress Percent
attribute20 17 17 0
100%
attribute21 9 9 0
100%
general 8 0 8
0%
tag20 22 22 0
100%
tag21 4 4 0
100%
variable 25 0 25
0%
Package: Test:
Tests
Package Test Result
com.sun.ts.tests.jsp.spec.tagfiles.directives.variable.URLClient falseDeclareTest FAILED
com.sun.ts.tests.jsp.spec.tagfiles.directives.variable.URLClient negativeAliasAttributeSameIncludeTest FAILED
com.sun.ts.tests.jsp.spec.tagfiles.directives.variable.URLClient negativeAliasAttributeSameTest FAILED
com.sun.ts.tests.jsp.spec.tagfiles.directives.variable.URLClient negativeAliasNameGivenTest FAILED
com.sun.ts.tests.jsp.spec.tagfiles.directives.variable.URLClient negativeNameFromAttributeNoAttributeTest FAILED
com.sun.ts.tests.jsp.spec.tagfiles.directives.variable.URLClient negativeNameFromAttributeNotRequiredTest FAILED
com.sun.ts.tests.jsp.spec.tagfiles.directives.variable.URLClient negativeNameFromAttributeNotStringTest FAILED
com.sun.ts.tests.jsp.spec.tagfiles.directives.variable.URLClient negativeNameFromAttributeRtexprTest FAILED
com.sun.ts.tests.jsp.spec.tagfiles.directives.variable.URLClient negativeNameFromAttributeSameIncludeTest FAILED
com.sun.ts.tests.jsp.spec.tagfiles.directives.variable.URLClient negativeNameFromAttributeSameTest FAILED
com.sun.ts.tests.jsp.spec.tagfiles.directives.variable.URLClient negativeNameGivenBothTest FAILED
com.sun.ts.tests.jsp.spec.tagfiles.directives.variable.URLClient negativeNameGivenDynamicIncludeTest FAILED
com.sun.ts.tests.jsp.spec.tagfiles.directives.variable.URLClient negativeNameGivenDynamicTest FAILED
com.sun.ts.tests.jsp.spec.tagfiles.directives.variable.URLClient negativeNameGivenNeitherTest FAILED
com.sun.ts.tests.jsp.spec.tagfiles.directives.variable.URLClient negativeNameGivenSameIncludeTest FAILED
com.sun.ts.tests.jsp.spec.tagfiles.directives.variable.URLClient negativeNameGivenSameTest FAILED
com.sun.ts.tests.jsp.spec.tagfiles.directives.variable.URLClient positiveDeclareTest FAILED
com.sun.ts.tests.jsp.spec.tagfiles.directives.variable.URLClient positiveVariableClassTest FAILED
com.sun.ts.tests.jsp.spec.tagfiles.directives.variable.URLClient syncAtBeginNameFromAttributeTest FAILED
com.sun.ts.tests.jsp.spec.tagfiles.directives.variable.URLClient syncAtBeginTest FAILED
<< < 61 - 80 of 85 > >>
requeue tests (85 tests) - analyze issues (85 tests) - run script (85 tests) - download logs zip (85 tests)