Summary
PASSED 823
   47%
FAILED 901
   52%
ALL 1724
Subsections
Name Total Passed Failed Progress Percent
api 844 146 698
17%
compat 2 0 2
0%
ee 16 14 2
87%
pluggability 656 651 5
99%
spec 206 12 194
5%
Package: Test:
Tests
Package Test Result
com.sun.ts.tests.servlet.pluggability.api.jakarta_servlet_http.httpsessionbindinglistener.URLClient unBoundTest PASSED
com.sun.ts.tests.servlet.pluggability.api.jakarta_servlet_http.httpsessionevent.URLClient constructorTest PASSED
com.sun.ts.tests.servlet.pluggability.api.jakarta_servlet_http.httpsessionevent.URLClient getSessionTest PASSED
com.sun.ts.tests.servlet.pluggability.api.jakarta_servlet_http.httpsessionlistener.URLClient createdTest PASSED
com.sun.ts.tests.servlet.pluggability.api.jakarta_servlet_http.httpsessionlistener.URLClient destroyedTest PASSED
com.sun.ts.tests.servlet.pluggability.api.jakarta_servlet_http.sessioncookieconfig.URLClient constructortest1 PASSED
com.sun.ts.tests.servlet.pluggability.api.jakarta_servlet_http.sessioncookieconfig.URLClient setCommentTest PASSED
com.sun.ts.tests.servlet.pluggability.api.jakarta_servlet_http.sessioncookieconfig.URLClient setDomainTest PASSED
com.sun.ts.tests.servlet.pluggability.api.jakarta_servlet_http.sessioncookieconfig.URLClient setHttpOnlyTest PASSED
com.sun.ts.tests.servlet.pluggability.api.jakarta_servlet_http.sessioncookieconfig.URLClient setMaxAgeTest PASSED
com.sun.ts.tests.servlet.pluggability.api.jakarta_servlet_http.sessioncookieconfig.URLClient setNameTest PASSED
com.sun.ts.tests.servlet.pluggability.api.jakarta_servlet_http.sessioncookieconfig.URLClient setPathTest PASSED
com.sun.ts.tests.servlet.pluggability.api.jakarta_servlet_http.sessioncookieconfig.URLClient setSecureTest PASSED
com.sun.ts.tests.servlet.pluggability.fragment.URLClient addServletTest PASSED
com.sun.ts.tests.servlet.pluggability.fragment.URLClient addServletURLTest PASSED
com.sun.ts.tests.servlet.pluggability.fragment.URLClient filterOrderingTest PASSED
com.sun.ts.tests.servlet.pluggability.fragment.URLClient initParamTest PASSED
com.sun.ts.tests.servlet.pluggability.fragment.URLClient welcomefileTest PASSED
com.sun.ts.tests.servlet.spec.annotationservlet.webfilter.URLClient test1 FAILED
com.sun.ts.tests.servlet.spec.annotationservlet.webfilter.URLClient test2 FAILED
<< < 1501 - 1520 of 1724 > >>
requeue tests (1724 tests) - analyze issues (1724 tests) - run script (1724 tests) - download logs zip (1724 tests)