Summary
FAILED 906
   100%
ALL 906
Subsections
Name Total Passed Failed Progress Percent
Client 906 0 906
0%
Package: Test:
Tests
Package Test Result
com.sun.ts.tests.jpa.core.criteriaapi.metamodelquery.Client queryTest20_from_appmanaged FAILED
com.sun.ts.tests.jpa.core.criteriaapi.metamodelquery.Client queryTest20_from_appmanagedNoTx FAILED
com.sun.ts.tests.jpa.core.criteriaapi.metamodelquery.Client queryTest20_from_pmservlet FAILED
com.sun.ts.tests.jpa.core.criteriaapi.metamodelquery.Client queryTest20_from_puservlet FAILED
com.sun.ts.tests.jpa.core.criteriaapi.metamodelquery.Client queryTest20_from_stateful3 FAILED
com.sun.ts.tests.jpa.core.criteriaapi.metamodelquery.Client queryTest20_from_stateless3 FAILED
com.sun.ts.tests.jpa.core.criteriaapi.metamodelquery.Client queryTest21_from_appmanaged FAILED
com.sun.ts.tests.jpa.core.criteriaapi.metamodelquery.Client queryTest21_from_appmanagedNoTx FAILED
com.sun.ts.tests.jpa.core.criteriaapi.metamodelquery.Client queryTest21_from_pmservlet FAILED
com.sun.ts.tests.jpa.core.criteriaapi.metamodelquery.Client queryTest21_from_puservlet FAILED
com.sun.ts.tests.jpa.core.criteriaapi.metamodelquery.Client queryTest21_from_stateful3 FAILED
com.sun.ts.tests.jpa.core.criteriaapi.metamodelquery.Client queryTest21_from_stateless3 FAILED
com.sun.ts.tests.jpa.core.criteriaapi.metamodelquery.Client queryTest22_from_appmanaged FAILED
com.sun.ts.tests.jpa.core.criteriaapi.metamodelquery.Client queryTest22_from_appmanagedNoTx FAILED
com.sun.ts.tests.jpa.core.criteriaapi.metamodelquery.Client queryTest22_from_pmservlet FAILED
com.sun.ts.tests.jpa.core.criteriaapi.metamodelquery.Client queryTest22_from_puservlet FAILED
com.sun.ts.tests.jpa.core.criteriaapi.metamodelquery.Client queryTest22_from_stateful3 FAILED
com.sun.ts.tests.jpa.core.criteriaapi.metamodelquery.Client queryTest22_from_stateless3 FAILED
com.sun.ts.tests.jpa.core.criteriaapi.metamodelquery.Client queryTest23_from_appmanaged FAILED
com.sun.ts.tests.jpa.core.criteriaapi.metamodelquery.Client queryTest23_from_appmanagedNoTx FAILED
<< < 181 - 200 of 906 > >>
requeue tests (906 tests) - analyze issues (906 tests) - run script (906 tests) - download logs zip (906 tests)