Summary
FAILED 930
   100%
ALL 930
Subsections
Name Total Passed Failed Progress Percent
Package: Test:
Tests
Package Test Result
com.sun.ts.tests.jpa.core.criteriaapi.CriteriaBuilder.Client geExpExpTest_from_pmservlet FAILED
com.sun.ts.tests.jpa.core.criteriaapi.CriteriaBuilder.Client geExpExpTest_from_puservlet FAILED
com.sun.ts.tests.jpa.core.criteriaapi.CriteriaBuilder.Client geExpExpTest_from_stateful3 FAILED
com.sun.ts.tests.jpa.core.criteriaapi.CriteriaBuilder.Client geExpExpTest_from_stateless3 FAILED
com.sun.ts.tests.jpa.core.criteriaapi.CriteriaBuilder.Client geExpNumTest_from_appmanaged FAILED
com.sun.ts.tests.jpa.core.criteriaapi.CriteriaBuilder.Client geExpNumTest_from_appmanagedNoTx FAILED
com.sun.ts.tests.jpa.core.criteriaapi.CriteriaBuilder.Client geExpNumTest_from_pmservlet FAILED
com.sun.ts.tests.jpa.core.criteriaapi.CriteriaBuilder.Client geExpNumTest_from_puservlet FAILED
com.sun.ts.tests.jpa.core.criteriaapi.CriteriaBuilder.Client geExpNumTest_from_stateful3 FAILED
com.sun.ts.tests.jpa.core.criteriaapi.CriteriaBuilder.Client geExpNumTest_from_stateless3 FAILED
com.sun.ts.tests.jpa.core.criteriaapi.CriteriaBuilder.Client greaterThanExpExpTest_from_appmanaged FAILED
com.sun.ts.tests.jpa.core.criteriaapi.CriteriaBuilder.Client greaterThanExpExpTest_from_appmanagedNoTx FAILED
com.sun.ts.tests.jpa.core.criteriaapi.CriteriaBuilder.Client greaterThanExpExpTest_from_pmservlet FAILED
com.sun.ts.tests.jpa.core.criteriaapi.CriteriaBuilder.Client greaterThanExpExpTest_from_puservlet FAILED
com.sun.ts.tests.jpa.core.criteriaapi.CriteriaBuilder.Client greaterThanExpExpTest_from_stateful3 FAILED
com.sun.ts.tests.jpa.core.criteriaapi.CriteriaBuilder.Client greaterThanExpExpTest_from_stateless3 FAILED
com.sun.ts.tests.jpa.core.criteriaapi.CriteriaBuilder.Client greaterThanExpNumTest_from_appmanaged FAILED
com.sun.ts.tests.jpa.core.criteriaapi.CriteriaBuilder.Client greaterThanExpNumTest_from_appmanagedNoTx FAILED
com.sun.ts.tests.jpa.core.criteriaapi.CriteriaBuilder.Client greaterThanExpNumTest_from_pmservlet FAILED
com.sun.ts.tests.jpa.core.criteriaapi.CriteriaBuilder.Client greaterThanExpNumTest_from_puservlet FAILED
<< < 261 - 280 of 930 > >>
requeue tests (930 tests) - analyze issues (930 tests) - run script (930 tests) - download logs zip (930 tests)