Section
Summary
PASSED 474
   15%
FAILED 2565
   84%
ALL 3039
Subsections (status=failed)
Name Total Passed Failed Progress Percent
ts 2565 0 2565
0%
Package: Test:
Tests (status=failed)
Package Test Result
com.sun.ts.tests.servlet.spec.serverpush.Client serverPushMiscTest FAILED
com.sun.ts.tests.servlet.spec.serverpush.Client serverPushNegtiveTest FAILED
com.sun.ts.tests.servlet.spec.serverpush.Client serverPushSessionTest FAILED
com.sun.ts.tests.servlet.spec.serverpush.Client serverPushSessionTest2 FAILED
com.sun.ts.tests.servlet.spec.serverpush.Client serverPushTest FAILED
com.sun.ts.tests.servlet.spec.servletcontext.URLClient getJspConfigDescriptorTest FAILED
com.sun.ts.tests.servlet.spec.servletmapping.URLClient multiURLmappingTest1 FAILED
com.sun.ts.tests.servlet.spec.servletmapping.URLClient multiURLmappingTest2 FAILED
com.sun.ts.tests.servlet.spec.servletmapping.URLClient multiURLmappingTest3 FAILED
com.sun.ts.tests.servlet.spec.servletmapping.URLClient multiURLmappingTest4 FAILED
com.sun.ts.tests.servlet.spec.srlistener.URLClient error FAILED
com.sun.ts.tests.servlet.spec.srlistener.URLClient forwarderror FAILED
com.sun.ts.tests.servlet.spec.srlistener.URLClient forwardinclude FAILED
com.sun.ts.tests.servlet.spec.srlistener.URLClient includeerror FAILED
com.sun.ts.tests.servlet.spec.srlistener.URLClient includeforward FAILED
com.sun.ts.tests.servlet.spec.srlistener.URLClient multipleforwards FAILED
com.sun.ts.tests.servlet.spec.srlistener.URLClient multipleincludes FAILED
com.sun.ts.tests.servlet.spec.srlistener.URLClient simpleasync FAILED
com.sun.ts.tests.servlet.spec.srlistener.URLClient simpleasyncerror FAILED
com.sun.ts.tests.servlet.spec.srlistener.URLClient simpleasyncforward FAILED
<< < 2541 - 2560 of 2565 > >>
requeue tests (2565 tests) - analyze issues (2565 tests) - run script (2565 tests) - download logs zip (2565 tests)