Summary
PASSED 5
   0%
FAILED 2564
   99%
ALL 2569
Subsections (status=failed)
Name Total Passed Failed Progress Percent
jpa 15 0 15
0%
jsp 534 0 534
0%
jstl 489 0 489
0%
servlet 1526 0 1526
0%
Package: Test:
Tests (status=failed)
Package Test Result
com.sun.ts.tests.servlet.api.jakarta_servlet_http.httpsession.URLClient getIdIllegalStateExceptionTest FAILED
com.sun.ts.tests.servlet.api.jakarta_servlet_http.httpsession.URLClient getIdTestServlet FAILED
com.sun.ts.tests.servlet.api.jakarta_servlet_http.httpsession.URLClient getLastAccessedTimeIllegalStateExceptionTest FAILED
com.sun.ts.tests.servlet.api.jakarta_servlet_http.httpsession.URLClient getLastAccessedTimeSetGetTest FAILED
com.sun.ts.tests.servlet.api.jakarta_servlet_http.httpsession.URLClient getLastAccessedTimeTest FAILED
com.sun.ts.tests.servlet.api.jakarta_servlet_http.httpsession.URLClient getMaxInactiveIntervalTest FAILED
com.sun.ts.tests.servlet.api.jakarta_servlet_http.httpsession.URLClient getServletContextTest FAILED
com.sun.ts.tests.servlet.api.jakarta_servlet_http.httpsession.URLClient invalidateIllegalStateExceptionTest FAILED
com.sun.ts.tests.servlet.api.jakarta_servlet_http.httpsession.URLClient invalidateTest FAILED
com.sun.ts.tests.servlet.api.jakarta_servlet_http.httpsession.URLClient isNewIllegalStateExceptionTest FAILED
com.sun.ts.tests.servlet.api.jakarta_servlet_http.httpsession.URLClient isNewTest FAILED
com.sun.ts.tests.servlet.api.jakarta_servlet_http.httpsession.URLClient removeAttributeDoNothingTest FAILED
com.sun.ts.tests.servlet.api.jakarta_servlet_http.httpsession.URLClient removeAttributeIllegalStateExceptionTest FAILED
com.sun.ts.tests.servlet.api.jakarta_servlet_http.httpsession.URLClient removeAttributeTest FAILED
com.sun.ts.tests.servlet.api.jakarta_servlet_http.httpsession.URLClient setAttributeIllegalStateExceptionTest FAILED
com.sun.ts.tests.servlet.api.jakarta_servlet_http.httpsession.URLClient setAttributeNullTest FAILED
com.sun.ts.tests.servlet.api.jakarta_servlet_http.httpsession.URLClient setAttributeTest FAILED
com.sun.ts.tests.servlet.api.jakarta_servlet_http.httpsession.URLClient setMaxInactiveIntervalTest FAILED
com.sun.ts.tests.servlet.api.jakarta_servlet_http.httpsessionactivationlistener40.URLClient defaultMethodsTest FAILED
com.sun.ts.tests.servlet.api.jakarta_servlet_http.httpsessionattributelistener.URLClient attributeAddedTest FAILED
<< < 1781 - 1800 of 2564 > >>
requeue tests (2564 tests) - analyze issues (2564 tests) - run script (2564 tests) - download logs zip (2564 tests)