Section
Summary
PASSED 10632
   44%
FAILED 13034
   55%
ALL 23666
Subsections (status=failed)
Name Total Passed Failed Progress Percent
sun 13034 0 13034
0%
Package: Test:
Tests (status=failed)
Package Test Result
com.sun.ts.tests.ejb30.lite.async.stateless.descriptor.Client intParams_from_ejbliteservlet2 FAILED
com.sun.ts.tests.ejb30.lite.async.stateless.descriptor.Client intParamsLocalViews_from_ejblitejsp FAILED
com.sun.ts.tests.ejb30.lite.async.stateless.descriptor.Client intParamsLocalViews_from_ejbliteservlet FAILED
com.sun.ts.tests.ejb30.lite.async.stateless.descriptor.Client intParamsLocalViews_from_ejbliteservlet2 FAILED
com.sun.ts.tests.ejb30.lite.async.stateless.descriptor.Client localViews_from_ejblitejsp FAILED
com.sun.ts.tests.ejb30.lite.async.stateless.descriptor.Client localViews_from_ejbliteservlet FAILED
com.sun.ts.tests.ejb30.lite.async.stateless.descriptor.Client localViews_from_ejbliteservlet2 FAILED
com.sun.ts.tests.ejb30.lite.async.stateless.descriptor.Client noParams_from_ejblitejsp FAILED
com.sun.ts.tests.ejb30.lite.async.stateless.descriptor.Client noParams_from_ejbliteservlet FAILED
com.sun.ts.tests.ejb30.lite.async.stateless.descriptor.Client noParams_from_ejbliteservlet2 FAILED
com.sun.ts.tests.ejb30.lite.async.stateless.descriptor.JsfClient allParams_from_ejblitejsf FAILED
com.sun.ts.tests.ejb30.lite.async.stateless.descriptor.JsfClient allViews_from_ejblitejsf FAILED
com.sun.ts.tests.ejb30.lite.async.stateless.descriptor.JsfClient intParams_from_ejblitejsf FAILED
com.sun.ts.tests.ejb30.lite.async.stateless.descriptor.JsfClient intParamsLocalViews_from_ejblitejsf FAILED
com.sun.ts.tests.ejb30.lite.async.stateless.descriptor.JsfClient localViews_from_ejblitejsf FAILED
com.sun.ts.tests.ejb30.lite.async.stateless.descriptor.JsfClient noParams_from_ejblitejsf FAILED
com.sun.ts.tests.ejb30.lite.async.stateless.metadata.Client beanClassLevelReturnType_from_ejblitejsp FAILED
com.sun.ts.tests.ejb30.lite.async.stateless.metadata.Client beanClassLevelReturnType_from_ejbliteservlet FAILED
com.sun.ts.tests.ejb30.lite.async.stateless.metadata.Client beanClassLevelReturnType_from_ejbliteservlet2 FAILED
com.sun.ts.tests.ejb30.lite.async.stateless.metadata.Client beanClassLevelRuntimeException_from_ejblitejsp FAILED
<< < 561 - 580 of 13034 > >>
requeue tests (13034 tests) - analyze issues (13034 tests) - run script (13034 tests) - download logs zip (13034 tests)