Section
Summary
PASSED 10632
   44%
FAILED 13034
   55%
ALL 23666
Subsections
Name Total Passed Failed Progress Percent
tests 23666 10632 13034
44%
Package: Test:
Tests
Package Test Result
com.sun.ts.tests.ejb30.lite.async.stateful.metadata.Client beanClassLevelSyncMethod_from_ejbliteservlet FAILED
com.sun.ts.tests.ejb30.lite.async.stateful.metadata.Client beanClassLevelSyncMethod_from_ejbliteservlet2 FAILED
com.sun.ts.tests.ejb30.lite.async.stateful.metadata.Client customFutureImpl_from_ejblitejsp FAILED
com.sun.ts.tests.ejb30.lite.async.stateful.metadata.Client customFutureImpl_from_ejbliteservlet FAILED
com.sun.ts.tests.ejb30.lite.async.stateful.metadata.Client customFutureImpl_from_ejbliteservlet2 FAILED
com.sun.ts.tests.ejb30.lite.async.stateful.metadata.JsfClient beanClassLevelReturnType_from_ejblitejsf FAILED
com.sun.ts.tests.ejb30.lite.async.stateful.metadata.JsfClient beanClassLevelRuntimeException_from_ejblitejsf FAILED
com.sun.ts.tests.ejb30.lite.async.stateful.metadata.JsfClient beanClassLevelSyncMethod_from_ejblitejsf FAILED
com.sun.ts.tests.ejb30.lite.async.stateful.metadata.JsfClient customFutureImpl_from_ejblitejsf FAILED
com.sun.ts.tests.ejb30.lite.async.stateless.annotated.Client addAway_from_ejblitejsp FAILED
com.sun.ts.tests.ejb30.lite.async.stateless.annotated.Client addAway_from_ejbliteservlet FAILED
com.sun.ts.tests.ejb30.lite.async.stateless.annotated.Client addAway_from_ejbliteservlet2 FAILED
com.sun.ts.tests.ejb30.lite.async.stateless.annotated.Client addReturn_from_ejblitejsp FAILED
com.sun.ts.tests.ejb30.lite.async.stateless.annotated.Client addReturn_from_ejbliteservlet FAILED
com.sun.ts.tests.ejb30.lite.async.stateless.annotated.Client addReturn_from_ejbliteservlet2 FAILED
com.sun.ts.tests.ejb30.lite.async.stateless.annotated.Client addReturnWaitMillis_from_ejblitejsp FAILED
com.sun.ts.tests.ejb30.lite.async.stateless.annotated.Client addReturnWaitMillis_from_ejbliteservlet FAILED
com.sun.ts.tests.ejb30.lite.async.stateless.annotated.Client addReturnWaitMillis_from_ejbliteservlet2 FAILED
com.sun.ts.tests.ejb30.lite.async.stateless.annotated.Client addSyncReturn_from_ejblitejsp FAILED
com.sun.ts.tests.ejb30.lite.async.stateless.annotated.Client addSyncReturn_from_ejbliteservlet FAILED
<< < 561 - 580 of 23666 > >>
requeue tests (23666 tests) - analyze issues (23666 tests) - run script (23666 tests) - download logs zip (23666 tests)